vector-n
type: LexicalEntry
canonical form: vector
sense: 13936278-n
part of speech: noun

13936278-n
type: LexicalConcept
in scheme: en-word.net
definition: a straight line segment whose length is magnitude and whose orientation in space is direction
ili: i110060
lexfile: noun.shape
part of speech: noun
hypernym: 13892630-n