groove-n
type: LexicalEntry
canonical form: groove
sense: 13916479-n
part of speech: noun

channel-n
type: LexicalEntry
canonical form: channel
sense: 13916479-n
part of speech: noun

13916479-n
type: LexicalConcept
in scheme: en-word.net
definition: a long narrow furrow cut either by a natural process (such as erosion) or by a tool (as e.g. a groove in a phonograph record)
ili: i109952
lexfile: noun.shape
part of speech: noun
hypernym: 13919062-n