star-n
type: LexicalEntry
canonical form: star
sense: 13904301-n
part of speech: noun

13904301-n
type: LexicalConcept
in scheme: en-word.net
definition: a plane figure with 5 or more points; often used as an emblem
ili: i109879
lexfile: noun.shape
part of speech: noun
hypernym: 13885789-n