square-n
type: LexicalEntry
canonical form: square
sense: 13901590-n
part of speech: noun

13901590-n
type: LexicalConcept
in scheme: en-word.net
definition: something approximating the shape of a square
ili: i109861
lexfile: noun.shape
part of speech: noun
hypernym: 00028005-n