sector-n
type: LexicalEntry
canonical form: sector
sense: 13897666-n
part of speech: noun

13897666-n
type: LexicalConcept
in scheme: en-word.net
definition: a plane figure bounded by two radii and the included arc of a circle
ili: i109842
lexfile: noun.shape
part of speech: noun
hypernym: 13885789-n
mero part: 13897023-n