figure-n
type: LexicalEntry
canonical form: figure
sense: 13885383-n
part of speech: noun

13885383-n
type: LexicalConcept
in scheme: en-word.net
definition: a combination of points and lines and planes that form a visible palpable shape
ili: i109776
lexfile: noun.shape
part of speech: noun
hypernym: 00028005-n