conflict-n
type: LexicalEntry
canonical form: conflict
sense: 13877574-n
part of speech: noun

13877574-n
type: LexicalConcept
in scheme: en-word.net
definition: opposition in a work of drama or fiction between characters or forces (especially an opposition that motivates the development of the plot)
example: this form of conflict is essential to Mann's writing
ili: i109736
lexfile: noun.relation
part of speech: noun
hypernym: 13876846-n