frequency-n
type: LexicalEntry
canonical form: frequency
sense: 13843782-n
part of speech: noun

relative frequency-n
type: LexicalEntry
canonical form: relative frequency
sense: 13843782-n
part of speech: noun

13843782-n
type: LexicalConcept
in scheme: en-word.net
definition: the ratio of the number of observations in a statistical category to the total number of observations
ili: i109536
lexfile: noun.relation
part of speech: noun
hypernym: 13841419-n