content-n-1
type: LexicalEntry
canonical form: content
sense: 13838733-n
part of speech: noun

13838733-n
type: LexicalConcept
in scheme: en-word.net
definition: the proportion of a substance that is contained in a mixture or alloy etc.
ili: i109510
lexfile: noun.relation
part of speech: noun
hypernym: 13837954-n