sympathy-n
type: LexicalEntry
canonical form: sympathy
sense: 13834112-n
part of speech: noun

13834112-n
type: LexicalConcept
in scheme: en-word.net
definition: a relation of affinity or harmony between people; whatever affects one correspondingly affects the other
example: the two of them were in close sympathy
ili: i109486
lexfile: noun.relation
part of speech: noun
hypernym: 13833622-n