affinity-n
type: LexicalEntry
canonical form: affinity
sense: 13833622-n
part of speech: noun

kinship-n
type: LexicalEntry
canonical form: kinship
sense: 13833622-n
part of speech: noun

13833622-n
type: LexicalConcept
in scheme: en-word.net
definition: a close connection marked by community of interests or similarity in nature or character
example: found a natural affinity with the immigrants
example: felt a deep kinship with the other students
example: anthropology's kinship with the humanities
ili: i109484
lexfile: noun.relation
part of speech: noun
hypernym: 00032220-n