unit-n
type: LexicalEntry
canonical form: unit
sense: 13832535-n
part of speech: noun

13832535-n
type: LexicalConcept
in scheme: en-word.net
definition: an individual or group or structure or other entity regarded as a structural or functional constituent of a whole
example: they reduced the number of units and installations
example: the word is a basic linguistic unit
ili: i109479
lexfile: noun.relation
part of speech: noun
hypernym: 13831419-n