interrogative mood-n
type: LexicalEntry
canonical form: interrogative mood
sense: 13824697-n
part of speech: noun

interrogative-n
type: LexicalEntry
canonical form: interrogative
sense: 13824697-n
part of speech: noun

13824697-n
type: LexicalConcept
in scheme: en-word.net
definition: some linguists consider interrogative sentences to constitute a mood
ili: i109439
lexfile: noun.relation
part of speech: noun
hypernym: 13823636-n