association-n
type: LexicalEntry
canonical form: association
sense: 13804981-n
part of speech: noun

13804981-n
type: LexicalConcept
in scheme: en-word.net
definition: a relation resulting from interaction or dependence
example: flints were found in association with the prehistoric remains of the bear
example: the host is not always injured by association with a parasite
ili: i109338
lexfile: noun.relation
part of speech: noun
hypernym: 00032220-n