load-n
type: LexicalEntry
canonical form: load
sense: 13794608-n
part of speech: noun

loading-n
type: LexicalEntry
canonical form: loading
sense: 13794608-n
part of speech: noun

13794608-n
type: LexicalConcept
in scheme: en-word.net
definition: a quantity that can be processed or transported at one time
example: the system broke down under excessive loads
ili: i109281
lexfile: noun.quantity
part of speech: noun
hypernym: 13597558-n