barrel-n
type: LexicalEntry
canonical form: barrel
sense: 13786904-n
part of speech: noun

barrelful-n
type: LexicalEntry
canonical form: barrelful
sense: 13786904-n
part of speech: noun

13786904-n
type: LexicalConcept
in scheme: en-word.net
definition: the quantity that a barrel (of any size) will hold
ili: i109214
lexfile: noun.quantity
part of speech: noun
hypernym: 13778265-n