limit-n
type: LexicalEntry
canonical form: limit
sense: 13780436-n
part of speech: noun

limitation-n
type: LexicalEntry
canonical form: limitation
sense: 13780436-n
part of speech: noun

13780436-n
type: LexicalConcept
in scheme: en-word.net
definition: the greatest amount of something that is possible or allowed
example: there are limits on the amount you can bet
example: it is growing rapidly with no limitation in sight
ili: i109179
lexfile: noun.quantity
part of speech: noun
hypernym: 13597558-n