correction-n
type: LexicalEntry
canonical form: correction
sense: 13778097-n
part of speech: noun

fudge factor-n
type: LexicalEntry
canonical form: fudge factor
sense: 13778097-n
part of speech: noun

13778097-n
type: LexicalConcept
in scheme: en-word.net
definition: a quantity that is added or subtracted in order to increase the accuracy of a scientific measure
ili: i109173
lexfile: noun.quantity
part of speech: noun
hypernym: 13597558-n