divisor-n
type: LexicalEntry
canonical form: divisor
sense: 13755542-n
part of speech: noun

factor-n
type: LexicalEntry
canonical form: factor
sense: 13755542-n
part of speech: noun

13755542-n
type: LexicalConcept
in scheme: en-word.net
definition: one of two or more integers that can be exactly divided into another integer
example: what are the 4 factors of 6?
ili: i109034
lexfile: noun.quantity
part of speech: noun
hypernym: 13750609-n