quarter-n
type: LexicalEntry
canonical form: quarter
sense: 13742957-n
part of speech: noun

13742957-n
type: LexicalConcept
in scheme: en-word.net
definition: a quarter of a hundredweight (25 pounds)
ili: i108958
lexfile: noun.quantity
part of speech: noun
hypernym: 13738189-n
mero part: 13742201-n
mero part: 13742705-n