point-n
type: LexicalEntry
canonical form: point
sense: 13734391-n
part of speech: noun

13734391-n
type: LexicalConcept
in scheme: en-word.net
definition: a linear unit used to measure the size of type; approximately 1/72 inch
ili: i108903
lexfile: noun.quantity
part of speech: noun
hypernym: 13624548-n