Somalian shilling-n
type: LexicalEntry
canonical form: Somalian shilling
sense: 13728969-n
part of speech: noun

shilling-n
type: LexicalEntry
canonical form: shilling
sense: 13728969-n
part of speech: noun

13728969-n
type: LexicalConcept
in scheme: en-word.net
definition: the basic unit of money in Somalia; equal to 100 cents
ili: i108860
lexfile: noun.quantity
part of speech: noun
hypernym: 13728858-n