sector-n
type: LexicalEntry
canonical form: sector
sense: 13647711-n
part of speech: noun

13647711-n
type: LexicalConcept
in scheme: en-word.net
definition: the minimum track length that can be assigned to store information; unless otherwise specified a sector of data consists of 512 bytes
ili: i108299
lexfile: noun.quantity
part of speech: noun
hypernym: 13622839-n