last-n
type: LexicalEntry
canonical form: last
sense: 13639461-n
part of speech: noun

13639461-n
type: LexicalConcept
in scheme: en-word.net
definition: a unit of capacity for grain equal to 80 bushels
ili: i108254
lexfile: noun.quantity
part of speech: noun
domain region: 08879115-n
hypernym: 13622065-n