unit of measurement-n
type: LexicalEntry
canonical form: unit of measurement
sense: 13604927-n
part of speech: noun

unit-n
type: LexicalEntry
canonical form: unit
sense: 13604927-n
part of speech: noun

13604927-n
type: LexicalConcept
in scheme: en-word.net
definition: any division of quantity accepted as a standard of measurement or exchange
example: the dollar is the United States unit of currency
example: a unit of wheat is a bushel
example: change per unit volume
ili: i108085
lexfile: noun.quantity
part of speech: noun
hypernym: 13597304-n