protein folding-n
type: LexicalEntry
canonical form: protein folding
sense: 13590429-n
part of speech: noun

folding-n
type: LexicalEntry
canonical form: folding
sense: 13590429-n
part of speech: noun

13590429-n
type: LexicalConcept
in scheme: en-word.net
definition: the process whereby a protein molecule assumes its intricate three-dimensional shape
example: understanding protein folding is the next step in deciphering the genetic code
ili: i108016
lexfile: noun.process
part of speech: noun
hypernym: 13547313-n