succession-n
type: LexicalEntry
canonical form: succession
sense: 13584065-n
part of speech: noun

ecological succession-n
type: LexicalEntry
canonical form: ecological succession
sense: 13584065-n
part of speech: noun

13584065-n
type: LexicalConcept
in scheme: en-word.net
definition: (ecology) the gradual and orderly process of change in an ecosystem brought about by the progressive replacement of one community by another until a stable climax is established
ili: i107982
lexfile: noun.process
part of speech: noun
domain topic: 06080479-n
hypernym: 13540166-n