stimulation-n
type: LexicalEntry
canonical form: stimulation
sense: 13582922-n
part of speech: noun

13582922-n
type: LexicalConcept
in scheme: en-word.net
definition: (physiology) the effect of a stimulus (on nerves or organs etc.)
ili: i107976
lexfile: noun.process
part of speech: noun
domain topic: 06090110-n
hypernym: 13540166-n