source-n
type: LexicalEntry
canonical form: source
sense: 13580156-n
part of speech: noun

13580156-n
type: LexicalConcept
in scheme: en-word.net
definition: (technology) a process by which energy or a substance enters a system
example: a heat source
example: a source of carbon dioxide
ili: i107961
lexfile: noun.process
part of speech: noun
domain topic: 06134474-n
hypernym: 13540166-n