omission-n
type: LexicalEntry
canonical form: omission
sense: 13545602-n
part of speech: noun

deletion-n
type: LexicalEntry
canonical form: deletion
sense: 13545602-n
part of speech: noun

13545602-n
type: LexicalConcept
in scheme: en-word.net
definition: any process whereby sounds or words are left out of spoken words or phrases
ili: i107791
lexfile: noun.process
part of speech: noun
hypernym: 13529536-n