neoplasia-n
type: LexicalEntry
canonical form: neoplasia
sense: 13542052-n
part of speech: noun

13542052-n
type: LexicalConcept
in scheme: en-word.net
definition: the pathological process that results in the formation and growth of a tumor
ili: i107772
lexfile: noun.process
part of speech: noun
hypernym: 13554673-n