mechanism-n
type: LexicalEntry
canonical form: mechanism
sense: 13533709-n
part of speech: noun

chemical mechanism-n
type: LexicalEntry
canonical form: chemical mechanism
sense: 13533709-n
part of speech: noun

13533709-n
type: LexicalConcept
in scheme: en-word.net
definition: the atomic process that occurs during a chemical reaction
example: he determined unique mechanisms for the photochemical reactions
ili: i107737
lexfile: noun.process
part of speech: noun
hypernym: 13467563-n