imbibition-n
type: LexicalEntry
canonical form: imbibition
sense: 13517220-n
part of speech: noun

13517220-n
type: LexicalConcept
in scheme: en-word.net
definition: (chemistry) the absorption of a liquid by a solid or gel
ili: i107652
lexfile: noun.process
part of speech: noun
domain topic: 06094057-n
hypernym: 13445095-n