heating-n
type: LexicalEntry
canonical form: heating
sense: 13513079-n
part of speech: noun

warming-n
type: LexicalEntry
canonical form: warming
sense: 13513079-n
part of speech: noun

13513079-n
type: LexicalConcept
in scheme: en-word.net
definition: the process of becoming warmer; a rising temperature
ili: i107629
lexfile: noun.process
part of speech: noun
hypernym: 13587415-n