habit-n
type: LexicalEntry
canonical form: habit
sense: 13512112-n
part of speech: noun

13512112-n
type: LexicalConcept
in scheme: en-word.net
definition: the general form or mode of growth (especially of a plant or crystal)
example: a shrub of spreading habit
ili: i107624
lexfile: noun.process
part of speech: noun
hypernym: 13510240-n