fusion-n
type: LexicalEntry
canonical form: fusion
sense: 13506970-n
part of speech: noun

13506970-n
type: LexicalConcept
in scheme: en-word.net
definition: the merging of adjacent sounds or syllables or words
ili: i107601
lexfile: noun.process
part of speech: noun
hypernym: 13529536-n