expression-n
type: LexicalEntry
canonical form: expression
sense: 13499408-n
part of speech: noun

13499408-n
type: LexicalConcept
in scheme: en-word.net
definition: (genetics) the process of expressing a gene
ili: i107563
lexfile: noun.process
part of speech: noun
domain topic: 06085077-n
hypernym: 13547313-n