establishment-n
type: LexicalEntry
canonical form: establishment
sense: 13497470-n
part of speech: noun

ecesis-n
type: LexicalEntry
canonical form: ecesis
sense: 13497470-n
part of speech: noun

13497470-n
type: LexicalConcept
in scheme: en-word.net
definition: (ecology) the process by which a plant or animal becomes established in a new habitat
ili: i107554
lexfile: noun.process
part of speech: noun
domain topic: 06080479-n
hypernym: 13540166-n