emission-n
type: LexicalEntry
canonical form: emission
sense: 13495493-n
part of speech: noun

13495493-n
type: LexicalConcept
in scheme: en-word.net
definition: the release of electrons from parent atoms
ili: i107543
lexfile: noun.process
part of speech: noun
hypernym: 13570875-n