condensation-n
type: LexicalEntry
canonical form: condensation
sense: 13472521-n
part of speech: noun

13472521-n
type: LexicalConcept
in scheme: en-word.net
definition: the process of changing from a gaseous to a liquid or solid state
ili: i107430
lexfile: noun.process
part of speech: noun
hypernym: 13540166-n