chemical reaction-n
type: LexicalEntry
canonical form: chemical reaction
sense: 13468534-n
part of speech: noun

reaction-n
type: LexicalEntry
canonical form: reaction
sense: 13468534-n
part of speech: noun

13468534-n
type: LexicalConcept
in scheme: en-word.net
definition: (chemistry) a process in which one or more substances are changed into others
example: there was a chemical reaction of the lime with the ground water
ili: i107410
lexfile: noun.process
part of speech: noun
domain topic: 06094057-n
hypernym: 13467563-n