purse-n
type: LexicalEntry
canonical form: purse
sense: 13434467-n
part of speech: noun

13434467-n
type: LexicalConcept
in scheme: en-word.net
definition: a sum of money spoken of as the contents of a money purse
example: he made the contribution out of his own purse
example: he and his wife shared a common purse
ili: i107227
lexfile: noun.possession
part of speech: noun
hypernym: 13352213-n