inventory-n
type: LexicalEntry
canonical form: inventory
sense: 13433706-n
part of speech: noun

13433706-n
type: LexicalConcept
in scheme: en-word.net
definition: (accounting) the value of a firm's current assets including raw materials and work in progress and finished goods
ili: i107222
lexfile: noun.possession
part of speech: noun
domain topic: 05670377-n
hypernym: 13433494-n