quarter-n
type: LexicalEntry
canonical form: quarter
sense: 13411417-n
part of speech: noun

13411417-n
type: LexicalConcept
in scheme: en-word.net
definition: a United States or Canadian coin worth one fourth of a dollar
example: he fed four quarters into the slot machine
ili: i107088
lexfile: noun.possession
part of speech: noun
hypernym: 13409418-n