money order-n
type: LexicalEntry
canonical form: money order
sense: 13401993-n
part of speech: noun

postal order-n
type: LexicalEntry
canonical form: postal order
sense: 13401993-n
part of speech: noun

13401993-n
type: LexicalConcept
in scheme: en-word.net
definition: a written order for the payment of a sum to a named individual; obtainable and payable at a post office
ili: i107036
lexfile: noun.possession
part of speech: noun
hypernym: 13398441-n