credit-n
type: LexicalEntry
canonical form: credit
sense: 13395454-n
part of speech: noun

deferred payment-n
type: LexicalEntry
canonical form: deferred payment
sense: 13395454-n
part of speech: noun

13395454-n
type: LexicalConcept
in scheme: en-word.net
definition: arrangement for deferred payment for goods and services
ili: i106998
lexfile: noun.possession
part of speech: noun
hypernym: 13299398-n