margin-n
type: LexicalEntry
canonical form: margin
sense: 13372293-n
part of speech: noun

security deposit-n
type: LexicalEntry
canonical form: security deposit
sense: 13372293-n
part of speech: noun

13372293-n
type: LexicalConcept
in scheme: en-word.net
definition: the amount of collateral a customer deposits with a broker when borrowing from the broker to buy securities
ili: i106865
lexfile: noun.possession
part of speech: noun
hypernym: 13370849-n