assurance-n
type: LexicalEntry
canonical form: assurance
sense: 13366301-n
part of speech: noun

13366301-n
type: LexicalConcept
in scheme: en-word.net
definition: a British term for some kinds of insurance
ili: i106835
lexfile: noun.possession
part of speech: noun
domain region: 08879115-n
hypernym: 13365819-n