rate of depreciation-n
type: LexicalEntry
canonical form: rate of depreciation
sense: 13347472-n
part of speech: noun

depreciation rate-n
type: LexicalEntry
canonical form: depreciation rate
sense: 13347472-n
part of speech: noun

13347472-n
type: LexicalConcept
in scheme: en-word.net
definition: the rate at which the value of property is reduced; used to calculate tax deduction
ili: i106736
lexfile: noun.possession
part of speech: noun
hypernym: 13346032-n