reparation-n
type: LexicalEntry
canonical form: reparation
sense: 13313413-n
part of speech: noun

13313413-n
type: LexicalConcept
in scheme: en-word.net
definition: (usually plural) compensation exacted from a defeated nation by the victors
example: Germany was unable to pay the reparations demanded after World War I
ili: i106523
lexfile: noun.possession
part of speech: noun
exemplifies: 06306016-n
hypernym: 13303573-n